Target
Beta-2 adrenergic receptor
Ligand
BDBM50092019
Substrate
Meas. Tech.
ChEBML_38301
IC50
8800±n/a nM
Citation
 Brockunier, LLParmee, EROk, HOCandelore, MRCascieri, MAColwell, LFDeng, LFeeney, WPForrest, MJHom, GJMacIntyre, DETota, LWyvratt, MJFisher, MHWeber, AE Human beta3-adrenergic receptor agonists containing 1,2,3-triazole-substituted benzenesulfonamides. Bioorg Med Chem Lett 10:2111-4 (2000)  
Target
Name:
Beta-2 adrenergic receptor
Synonyms:
ADRB2 ADRB2_HUMAN Beta-2 adrenoceptor | Beta-2 adrenoreceptor
Type:
Mol. Mass.:
46461.69
Organism:
Homo sapiens (Human)
Description:
P07550
Residue:
413
  
Inhibitor
Name:
BDBM50092019
Synonyms:
CHEMBL67404 | N-{4-[2-((R)-2-Hydroxy-2-pyridin-3-yl-ethylamino)-ethyl]-phenyl}-4-[4-(2,4,6-trifluoro-benzyl)-[1,2,3]triazol-2-yl]-benzenesulfonamide
Type:
Small organic molecule
Emp. Form.:
C30H27F3N6O3S
Mol. Mass.:
608.634
SMILES:
O[C@@H](CNCCc1ccc(NS(=O)(=O)c2ccc(cc2)-n2ncc(Cc3c(F)cc(F)cc3F)n2)cc1)c1cccnc1
: