Target
Beta-1 adrenergic receptor
Ligand
BDBM50092022
Substrate
Meas. Tech.
ChEBML_37262
IC50
1300±n/a nM
Citation
 Brockunier, LLParmee, EROk, HOCandelore, MRCascieri, MAColwell, LFDeng, LFeeney, WPForrest, MJHom, GJMacIntyre, DETota, LWyvratt, MJFisher, MHWeber, AE Human beta3-adrenergic receptor agonists containing 1,2,3-triazole-substituted benzenesulfonamides. Bioorg Med Chem Lett 10:2111-4 (2000)  
Target
Name:
Beta-1 adrenergic receptor
Synonyms:
ADRB1 ADRB1_HUMAN Beta-1 adrenoceptor adrenergic Beta1
Type:
G Protein-Coupled Receptor (GPCR)
Mol. Mass.:
51338.40
Organism:
Homo sapiens (Human)
Description:
P08588
Residue:
477
  
Inhibitor
Name:
BDBM50092022
Synonyms:
CHEMBL302893 | N-{4-[2-((R)-2-Hydroxy-2-pyridin-3-yl-ethylamino)-ethyl]-phenyl}-4-[4-(4-trifluoromethoxy-phenyl)-[1,2,3]triazol-2-yl]-benzenesulfonamide
Type:
Small organic molecule
Emp. Form.:
C30H27F3N6O4S
Mol. Mass.:
624.633
SMILES:
O[C@@H](CNCCc1ccc(NS(=O)(=O)c2ccc(cc2)-n2ncc(n2)-c2ccc(OC(F)(F)F)cc2)cc1)c1cccnc1
: