Target
Beta-3 adrenergic receptor
Ligand
BDBM50092033
Substrate
Meas. Tech.
ChEBML_41696
EC50
14±n/a nM
Citation
 Brockunier, LLParmee, EROk, HOCandelore, MRCascieri, MAColwell, LFDeng, LFeeney, WPForrest, MJHom, GJMacIntyre, DETota, LWyvratt, MJFisher, MHWeber, AE Human beta3-adrenergic receptor agonists containing 1,2,3-triazole-substituted benzenesulfonamides. Bioorg Med Chem Lett 10:2111-4 (2000)  
Target
Name:
Beta-3 adrenergic receptor
Synonyms:
ADRB3 ADRB3_HUMAN Beta-2 adrenergic receptor and beta-3 adrenergic receptor Beta-3 adrenoreceptor | adrenergic Beta3
Type:
G Protein-Coupled Receptor (GPCR)
Mol. Mass.:
43534.88
Organism:
Homo sapiens (Human)
Description:
Residue:
408
  
Inhibitor
Name:
BDBM50092033
Synonyms:
4-[4-(3,4-Difluoro-phenyl)-[1,2,3]triazol-2-yl]-N-{4-[2-((R)-2-hydroxy-2-pyridin-3-yl-ethylamino)-ethyl]-phenyl}-benzenesulfonamide | CHEMBL63138
Type:
Small organic molecule
Emp. Form.:
C29H26F2N6O3S
Mol. Mass.:
576.617
SMILES:
O[C@@H](CNCCc1ccc(NS(=O)(=O)c2ccc(cc2)-n2ncc(n2)-c2ccc(F)c(F)c2)cc1)c1cccnc1
: