Target
Phosphatidylinositol 4,5-bisphosphate 3-kinase catalytic subunit beta isoform
Ligand
BDBM368625
Substrate
Meas. Tech.
ChEMBL_1985645 (CHEMBL4619051)
EC50
15±n/a nM
Citation
 Perreault, SArjmand, FChandrasekhar, JHao, JKeegan, KSKoditek, DLepist, EIMatson, CKMcGrath, MEPatel, LSedillo, KTherrien, JTill, NATomkinson, ATreiberg, JZherebina, YPhillips, G Discovery of an Atropisomeric PI3K? Selective Inhibitor through Optimization of the Hinge Binding Motif. ACS Med Chem Lett 11:1236-1243 (2020)  
Target
Name:
Phosphatidylinositol 4,5-bisphosphate 3-kinase catalytic subunit beta isoform
Synonyms:
PI3-kinase p110 subunit beta PI3Kbeta PIK3CB Phosphatidylinositol 4,5-bisphosphate 3-kinase catalytic subunit beta (PI3Kbeta) Phosphatidylinositol 4,5-bisphosphate 3-kinase catalytic subunit beta isoform (PI3K) Phosphatidylinositol 4,5-bisphosphate 3-kinase catalytic subunit beta isoform (PI3Kbeta) Phosphatidylinositol-4,5-bisphosphate 3-kinase catalytic subunit beta isoform Phosphoinositide 3-Kinase (PI3K), beta Chain A PtdIns-3-kinase p110
Type:
Enzyme Subunit
Mol. Mass.:
122769.00
Organism:
Homo sapiens (Human)
Description:
P42338
Residue:
1070
  
Inhibitor
Name:
BDBM368625
Synonyms:
US10227350, Compound 113 US10227350, Compound 44
Type:
Small organic molecule
Emp. Form.:
C25H14F2N8
Mol. Mass.:
464.4291
SMILES:
Cc1nc2c(cc(cc2n1-c1ccnc2c(F)ccc(F)c12)-c1ccnc(c1)C#N)-c1nnc[nH]1
: