Target
Urokinase-type plasminogen activator
Ligand
BDBM50099923
Substrate
Meas. Tech.
ChEBML_213135
Ki
47±n/a nM
Citation
 Subasinghe, NLIllig, CHoffman, JRudolph, MJWilson, KJSoll, RRandle, TGreen, DLewandowski, FZhang, MBone, RSpurlino, JDesJarlais, RDeckman, IMolloy, CJManthey, CZhou, ZSharp, CMaguire, DCrysler, CGrasberger, B Structure-based design, synthesis and SAR of a novel series of thiopheneamidine urokinase plasminogen activator inhibitors. Bioorg Med Chem Lett 11:1379-82 (2001)  
Target
Name:
Urokinase-type plasminogen activator
Synonyms:
3.4.21.73 U-plasminogen activator Urokinase Urokinase-type plasminogen activator chain B Urokinase-type plasminogen activator short chain A uPA
Type:
Enzyme
Mol. Mass.:
48528.62
Organism:
Homo sapiens (Human)
Description:
P00749
Residue:
431
  
Inhibitor
Name:
BDBM50099923
Synonyms:
CHEMBL29037 | N-{3-[2-(5-Carbamimidoyl-2-methylsulfanyl-thiophen-3-yl)-thiazol-4-yl]-phenyl}-4-fluoro-benzamide
Type:
Small organic molecule
Emp. Form.:
C22H17FN4OS3
Mol. Mass.:
468.59
SMILES:
CSc1sc(cc1-c1nc(cs1)-c1cccc(NC(=O)c2ccc(F)cc2)c1)C(N)=N
: