Target
Glucagon receptor
Ligand
BDBM50104366
Substrate
Meas. Tech.
ChEBML_72873
IC50
6.5±n/a nM
Citation
 Chang, LLSidler, KLCascieri, MAde Laszlo, SKoch, GLi, BMacCoss, MMantlo, NO'Keefe, SPang, MRolando, AHagmann, WK Substituted imidazoles as glucagon receptor antagonists. Bioorg Med Chem Lett 11:2549-53 (2001)  
Target
Name:
Glucagon receptor
Synonyms:
GCGR GLR_HUMAN Glucagon receptor (GlucR)
Type:
Enzyme
Mol. Mass.:
54026.92
Organism:
Homo sapiens (Human)
Description:
P47871
Residue:
477
  
Inhibitor
Name:
BDBM50104366
Synonyms:
4-[2-(4-Chloro-phenyl)-5-(2,4-dibutoxy-phenyl)-3H-imidazol-4-yl]-pyridine | CHEMBL86086
Type:
Small organic molecule
Emp. Form.:
C28H30ClN3O2
Mol. Mass.:
476.01
SMILES:
CCCCOc1ccc(-c2[nH]c(nc2-c2ccncc2)-c2ccc(Cl)cc2)c(OCCCC)c1
: