Target
Glucagon receptor
Ligand
BDBM50104362
Substrate
Meas. Tech.
ChEBML_72873
IC50
13.0±n/a nM
Citation
 Chang, LLSidler, KLCascieri, MAde Laszlo, SKoch, GLi, BMacCoss, MMantlo, NO'Keefe, SPang, MRolando, AHagmann, WK Substituted imidazoles as glucagon receptor antagonists. Bioorg Med Chem Lett 11:2549-53 (2001)  
Target
Name:
Glucagon receptor
Synonyms:
GCGR GLR_HUMAN Glucagon receptor (GlucR)
Type:
Enzyme
Mol. Mass.:
54026.92
Organism:
Homo sapiens (Human)
Description:
P47871
Residue:
477
  
Inhibitor
Name:
BDBM50104362
Synonyms:
4-[2-(4-Chloro-phenyl)-5-(3-phenoxy-phenyl)-3H-imidazol-4-yl]-pyridine | CHEMBL85807
Type:
Small organic molecule
Emp. Form.:
C26H18ClN3O
Mol. Mass.:
423.894
SMILES:
Clc1ccc(cc1)-c1nc(c([nH]1)-c1cccc(Oc2ccccc2)c1)-c1ccncc1
: