Target
Glucagon receptor
Ligand
BDBM50104374
Substrate
Meas. Tech.
ChEMBL_72873 (CHEMBL684124)
IC50
110±n/a nM
Citation
 Chang, LLSidler, KLCascieri, MAde Laszlo, SKoch, GLi, BMacCoss, MMantlo, NO'Keefe, SPang, MRolando, AHagmann, WK Substituted imidazoles as glucagon receptor antagonists. Bioorg Med Chem Lett 11:2549-53 (2001)  
Target
Name:
Glucagon receptor
Synonyms:
GCGR GLR_HUMAN Glucagon receptor (GlucR)
Type:
Enzyme
Mol. Mass.:
54026.92
Organism:
Homo sapiens (Human)
Description:
P47871
Residue:
477
  
Inhibitor
Name:
BDBM50104374
Synonyms:
4-[5-(2-Butoxy-phenyl)-2-(4-chloro-phenyl)-3H-imidazol-4-yl]-pyridine | CHEMBL315828
Type:
Small organic molecule
Emp. Form.:
C24H22ClN3O
Mol. Mass.:
403.904
SMILES:
CCCCOc1ccccc1-c1[nH]c(nc1-c1ccncc1)-c1ccc(Cl)cc1
: