Target
Sterol O-acyltransferase 1
Ligand
BDBM50106673
Substrate
Meas. Tech.
ChEMBL_28947 (CHEMBL636942)
IC50
>300000±n/a nM
Citation
 Giovannoni, MPPiaz, VDKwon, BMKim, MKKim, YKToma, LBarlocco, DBernini, FCanavesi, M 5,6-Diphenylpyridazine derivatives as acyl-CoA:cholesterol acyltransferase inhibitors. J Med Chem 44:4292-5 (2001)  
Target
Name:
Sterol O-acyltransferase 1
Synonyms:
ACAT-1 Acat SOAT1_RAT Sterol O-acyltransferase, Soat
Type:
PROTEIN
Mol. Mass.:
64165.56
Organism:
Rattus norvegicus
Description:
ChEMBL_28796
Residue:
545
  
Inhibitor
Name:
BDBM50106673
Synonyms:
6-(5,6-Diphenyl-pyridazin-3-ylsulfanyl)-hexanoic acid | CHEMBL137343
Type:
Small organic molecule
Emp. Form.:
C22H22N2O2S
Mol. Mass.:
378.487
SMILES:
OC(=O)CCCCCSc1cc(-c2ccccc2)c(nn1)-c1ccccc1
: