Target
Ecdysone receptor
Ligand
BDBM50128468
Substrate
Meas. Tech.
ChEBML_65453
EC50
640±n/a nM
Citation
 Smith, HCCavanaugh, CKFriz, JLThompson, CSSaggers, JAMichelotti, ELGarcia, JTice, CM Synthesis and SAR of cis-1-benzoyl-1,2,3,4-tetrahydroquinoline ligands for control of gene expression in ecdysone responsive systems. Bioorg Med Chem Lett 13:1943-6 (2003)  
Target
Name:
Ecdysone receptor
Synonyms:
20-hydroxy-ecdysone receptor AaEcR EcR Ecdysteroid receptor Nuclear receptor subfamily 1 group H member 1
Type:
PROTEIN
Mol. Mass.:
83656.95
Organism:
Aedes aegypti
Description:
ChEMBL_65453
Residue:
776
  
Inhibitor
Name:
BDBM50128468
Synonyms:
(4-Chloro-phenyl)-[(2R,4S)-6-fluoro-4-(4-fluoro-phenylamino)-2-methyl-3,4-dihydro-2H-quinolin-1-yl]-methanone | CHEMBL58297
Type:
Small organic molecule
Emp. Form.:
C23H19ClF2N2O
Mol. Mass.:
412.86
SMILES:
C[C@@H]1C[C@H](Nc2ccc(F)cc2)c2cc(F)ccc2N1C(=O)c1ccc(Cl)cc1
: