Target
Integrin alpha-IIb/beta-3
Ligand
BDBM50146490
Substrate
Meas. Tech.
ChEMBL_218195 (CHEMBL881547)
Ki
2100±n/a nM
Citation
 Xi, NArvedson, SEisenberg, SHan, NHandley, MHuang, LHuang, QKiselyov, ALiu, QLu, YNunez, GOsslund, TPowers, DTasker, ASWang, LXiang, TXu, SZhang, JZhu, JKendall, RDominguez, C N-Aryl-gamma-lactams as integrin alphavbeta3 antagonists. Bioorg Med Chem Lett 14:2905-9 (2004)  
Target
Name:
Integrin alpha-IIb/beta-3
Synonyms:
Glycoprotein IIb/IIIa
Type:
Mol. Mass.:
Description:
ASSAY_ID of EBI is 30109
Components:
This complex has 2 components.
Component 1
Name:
Integrin beta-3
Synonyms:
CD_antigen=CD61 GPIIIa ITGB3 Platelet membrane glycoprotein IIIa
Type:
Protein
Mol. Mass.:
87038.91
Organism:
Homo sapiens (Human)
Description:
P05106
Residue:
788
  
Component 2
Name:
Integrin alpha-IIb
Synonyms:
CD_antigen=CD41 GPIIb Glycoprotein IIb ITGA2B Integrin alpha-IIb heavy chain Integrin alpha-IIb light chain, form 2 Integrin alpha-V/beta-3 and alpha-IIb/beta 3 | Platelet membrane glycoprotein IIb
Type:
Protein
Mol. Mass.:
113354.85
Organism:
Homo sapiens (Human)
Description:
P08514
Residue:
1039
  
Inhibitor
Name:
BDBM50146490
Synonyms:
3-(S)-Benzo[1,3]dioxol-5-yl-3-({(R)-5-oxo-1-[3-(1,4,5,6-tetrahydro-pyrimidin-2-ylamino)-phenyl]-pyrrolidine-3-carbonyl}-amino)-propionic acid | CHEMBL431224
Type:
Small organic molecule
Emp. Form.:
C25H27N5O6
Mol. Mass.:
493.5118
SMILES:
OC(=O)C[C@H](NC(=O)[C@H]1CN(C(=O)C1)c1cccc(NC2=NCCCN2)c1)c1ccc2OCOc2c1
: