Target
Hypoxia-inducible factor 1-alpha inhibitor
Ligand
BDBM50580318
Substrate
Meas. Tech.
ChEMBL_2148056 (CHEMBL5032402)
IC50
15300±n/a nM
Citation
 Nowak, RPTumber, AHendrix, EAnsari, MSZSabatino, MAntonini, LAndrijes, RSalah, EMautone, NPellegrini, FRSimelis, KKawamura, AJohansson, CPasseri, DPellicciari, RCiogli, ADel Bufalo, DRagno, RColeman, MLTrisciuoglio, DMai, AOppermann, USchofield, CJRotili, D First-in-Class Inhibitors of the Ribosomal Oxygenase MINA53. J Med Chem 64:17031-17050 (2021)  
Target
Name:
Hypoxia-inducible factor 1-alpha inhibitor
Synonyms:
FIH1 HIF1N_HUMAN Hypoxia-inducible factor 1-alpha inhibitor
Type:
Enzyme
Mol. Mass.:
40278.92
Organism:
Homo sapiens (Human)
Description:
Q9NWT6
Residue:
349
  
Inhibitor
Name:
BDBM50580318
Synonyms:
CHEMBL5089117
Type:
Small organic molecule
Emp. Form.:
C6H6N2O3S
Mol. Mass.:
186.188
SMILES:
CSc1ncc(C(O)=O)c(=O)[nH]1
: