Target
Tyrosine-protein phosphatase non-receptor type 1
Ligand
BDBM50170984
Substrate
Meas. Tech.
ChEMBL_305357 (CHEMBL832737)
IC50
3800±n/a nM
Citation
 Lee, KBoovanahalli, SKNam, KYKang, SULee, MPhan, JWu, LWaugh, DSZhang, ZYNo, KTLee, JJBurke, TR Synthesis of tripeptides as potent Yersinia protein tyrosine phosphatase inhibitors. Bioorg Med Chem Lett 15:4037-42 (2005)  
Target
Name:
Tyrosine-protein phosphatase non-receptor type 1
Synonyms:
PTN1_HUMAN PTPN1 Protein tyrosine phosphatase-1B (PTP1B) Protein-tyrosine phosphatase 1B (PTP1B) Tyrosine-protein phosphatase non-receptor type 1 (PTP1B)
Type:
Protein phosphatase
Mol. Mass.:
49963.76
Organism:
Homo sapiens (Human)
Description:
Human recombinant GST-fusion PTP1B (1-435).
Residue:
435
  
Inhibitor
Name:
BDBM50170984
Synonyms:
(S)-4-{(S)-4-(R)-Carbamoyl-1-[4-(carboxy-difluoro-methoxy)-benzyl]-6-methyl-2-oxo-heptylcarbamoyl}-4-(9H-fluoren-9-ylmethoxycarbonylamino)-butyric acid benzyl ester | CHEMBL363338
Type:
Small organic molecule
Emp. Form.:
C45H47F2N3O10
Mol. Mass.:
827.8656
SMILES:
CC(C)C[C@H](CC(=O)[C@H](Cc1ccc(OC(F)(F)C(O)=O)cc1)NC(=O)[C@H](CCC(=O)OCc1ccccc1)NC(=O)OCC1c2ccccc2-c2ccccc12)C(N)=O
: