Target
Estrogen receptor beta
Ligand
BDBM50175415
Substrate
Meas. Tech.
ChEMBL_326627 (CHEMBL868727)
EC50
6.7±n/a nM
Citation
 Chesworth, RWessel, MDHeyden, LMangano, FMZawistoski, MGegnas, LGalluzzo, DLefker, BCameron, KOTickner, JLu, BCastleberry, TAPetersen, DNBrault, APerry, PNg, OOwen, TAPan, LKe, HZBrown, TAThompson, DDDaSilva-Jardine, P Estrogen receptor beta selective ligands: discovery and SAR of novel heterocyclic ligands. Bioorg Med Chem Lett 15:5562-6 (2005)  
Target
Name:
Estrogen receptor beta
Synonyms:
ESR2_RAT Esr2 Estrogen receptor beta | Nr3a2
Type:
PROTEIN
Mol. Mass.:
59173.80
Organism:
Rattus norvegicus
Description:
ChEMBL_803011
Residue:
530
  
Inhibitor
Name:
BDBM50175415
Synonyms:
4-(5-phenyl-2-(trifluoromethyl)-1H-imidazol-4-yl)phenol | CHEMBL200799
Type:
Small organic molecule
Emp. Form.:
C16H11F3N2O
Mol. Mass.:
304.2665
SMILES:
Oc1ccc(cc1)-c1[nH]c(nc1-c1ccccc1)C(F)(F)F
: