Target
Caspase-3
Ligand
BDBM50189368
Substrate
Meas. Tech.
ChEMBL_388621 (CHEMBL865481)
IC50
>10000±n/a nM
Citation
 Soper, DLSheville, JO'Neil, SVWang, YLaufersweiler, MCOppong, KAWos, JAEllis, CDFancher, ANLu, WSuchanek, MKWang, RLDe, BDemuth, TP Synthesis and evaluation of novel 1-(2-acylhydrazinocarbonyl)-cycloalkyl carboxamides as interleukin-1beta converting enzyme (ICE) inhibitors. Bioorg Med Chem Lett 16:4233-6 (2006)  
Target
Name:
Caspase-3
Synonyms:
Apopain CASP3 CPP-32 Caspase 3 Caspase-3 subunit p17 SCA-1 Yama protein | caspase-3 preproprotein
Type:
Hydrolase; heterotetramer of two heterodimers
Mol. Mass.:
31607.55
Organism:
Homo sapiens (Human)
Description:
Residue:
277
  
Inhibitor
Name:
BDBM50189368
Synonyms:
CHEMBL214215 | N'-(1-(((3S)-2-hydroxy-5-oxo-tetrahydrofuran-3-yl)carbamoyl)cyclohexanecarbonyl)-3-methoxybenzohydrazide
Type:
Small organic molecule
Emp. Form.:
C20H25N3O7
Mol. Mass.:
419.4284
SMILES:
COc1cccc(c1)C(=O)NNC(=O)C1(CCCCC1)C(=O)N[C@H]1CC(=O)OC1O
: