Target
Chymase
Ligand
BDBM50210733
Substrate
Meas. Tech.
ChEMBL_455468 (CHEMBL886244)
IC50
460±n/a nM
Citation
 Maruoka, HMuto, TTanaka, TImajo, STomimori, YFukuda, YNakatsuka, T Development of 6-benzyl substituted 4-aminocarbonyl-1,4-diazepane-2,5-diones as orally active human chymase inhibitors. Bioorg Med Chem Lett 17:3435-9 (2007)  
Target
Name:
Chymase
Synonyms:
Alpha-chymase CMA1_HUMAN CYM Mast cell protease I
Type:
Enzyme
Mol. Mass.:
27340.12
Organism:
Homo sapiens (Human)
Description:
Residue:
247
  
Inhibitor
Name:
BDBM50210733
Synonyms:
4-(1-(6-(5-chloro-2-methoxybenzyl)-2,5-dioxo-1,4-diazepane-4-carboxamido)propyl)-2-hydroxybenzoic acid | CHEMBL247975
Type:
Small organic molecule
Emp. Form.:
C24H26ClN3O7
Mol. Mass.:
503.932
SMILES:
CCC(NC(=O)N1CC(=O)NCC(Cc2cc(Cl)ccc2OC)C1=O)c1ccc(C(O)=O)c(O)c1
: