Target
Peroxisome proliferator-activated receptor gamma
Ligand
BDBM50214887
Substrate
Meas. Tech.
ChEMBL_456358 (CHEMBL888369)
EC50
>10000±n/a nM
Citation
 Yamazaki, YAbe, KToma, TNishikawa, MOzawa, HOkuda, AAraki, TOda, SInoue, KShibuya, KStaels, BFruchart, JC Design and synthesis of highly potent and selective human peroxisome proliferator-activated receptor alpha agonists. Bioorg Med Chem Lett 17:4689-93 (2007)  
Target
Name:
Peroxisome proliferator-activated receptor gamma
Synonyms:
NR1C3 PPAR-gamma PPARG_HUMAN Peroxisome proliferator-activated receptor gamma (PPAR gamma) Peroxisome proliferator-activated receptor gamma (PPARĪ³) peroxisome proliferator-activated receptor gamma isoform 2
Type:
Nuclear Receptor
Mol. Mass.:
57613.46
Organism:
Homo sapiens (Human)
Description:
P37231
Residue:
505
  
Inhibitor
Name:
BDBM50214887
Synonyms:
2-(3-((benzo[d]oxazol-2-yl(3-(4-fluorophenoxy)propyl)amino)methyl)phenoxy)butanoic acid | CHEMBL245865
Type:
Small organic molecule
Emp. Form.:
C27H27FN2O5
Mol. Mass.:
478.5121
SMILES:
CCC(Oc1cccc(CN(CCCOc2ccc(F)cc2)c2nc3ccccc3o2)c1)C(O)=O
: