Target
Peroxisome proliferator-activated receptor delta
Ligand
BDBM50214893
Substrate
Meas. Tech.
ChEMBL_456359 (CHEMBL888370)
EC50
120±n/a nM
Citation
 Yamazaki, YAbe, KToma, TNishikawa, MOzawa, HOkuda, AAraki, TOda, SInoue, KShibuya, KStaels, BFruchart, JC Design and synthesis of highly potent and selective human peroxisome proliferator-activated receptor alpha agonists. Bioorg Med Chem Lett 17:4689-93 (2007)  
Target
Name:
Peroxisome proliferator-activated receptor delta
Synonyms:
NR1C2 NUCI Nuclear receptor subfamily 1 group C member 2 PPAR-beta PPARD Peroxisome proliferator-activated receptor Peroxisome proliferator-activated receptor delta
Type:
Enzyme
Mol. Mass.:
49910.45
Organism:
Homo sapiens (Human)
Description:
Q03181
Residue:
441
  
Inhibitor
Name:
BDBM50214893
Synonyms:
2-(3-((benzo[d]oxazol-2-yl(3-(p-tolyloxy)propyl)amino)methyl)phenoxy)butanoic acid | CHEMBL246070
Type:
Small organic molecule
Emp. Form.:
C28H30N2O5
Mol. Mass.:
474.5482
SMILES:
CCC(Oc1cccc(CN(CCCOc2ccc(C)cc2)c2nc3ccccc3o2)c1)C(O)=O
: