Target
Hypoxia-inducible factor 1-alpha
Ligand
BDBM50222816
Substrate
Meas. Tech.
ChEMBL_458038 (CHEMBL924307)
IC50
>30000±n/a nM
Citation
 Boovanahalli, SKJin, XJin, YKim, JHDat, NTHong, YSLee, JHJung, SHLee, KLee, JJ Synthesis of (aryloxyacetylamino)-isonicotinic/nicotinic acid analogues as potent hypoxia-inducible factor (HIF)-1alpha inhibitors. Bioorg Med Chem Lett 17:6305-10 (2007)  
Target
Name:
Hypoxia-inducible factor 1-alpha
Synonyms:
BHLHE78 HIF-1-alpha, HIF-2-alpha HIF1A_HUMAN Hypoxia-inducible factor 1 alpha MOP1 von Hippel-Lindau disease tumor suppressor/Elongin-C/Elongin-B/HIF1A
Type:
Protein
Mol. Mass.:
92647.24
Organism:
Homo sapiens (Human)
Description:
Q16665
Residue:
826
  
Inhibitor
Name:
BDBM50222816
Synonyms:
5-[2-(4-adamantan-1-yl-phenoxy)-acetylamino]-nicotinic acid | CHEMBL399845
Type:
Small organic molecule
Emp. Form.:
C24H26N2O4
Mol. Mass.:
406.4742
SMILES:
OC(=O)c1cncc(NC(=O)COc2ccc(cc2)C23CC4CC(CC(C4)C2)C3)c1
: