Target
Corticotropin-releasing factor receptor 1
Ligand
BDBM50231911
Substrate
Meas. Tech.
ChEMBL_462097 (CHEMBL944929)
Ki
1063±n/a nM
Citation
 Yoon, TDe Lombaert, SBrodbeck, RGulianello, MChandrasekhar, JHorvath, RFGe, PKershaw, MTKrause, JEKehne, JHoffman, DDoller, DHodgetts, KJ The design, synthesis and structure-activity relationships of 1-aryl-4-aminoalkylisoquinolines: a novel series of CRF-1 receptor antagonists. Bioorg Med Chem Lett 18:891-6 (2008)  
Target
Name:
Corticotropin-releasing factor receptor 1
Synonyms:
CRF-R CRF1 CRFR1 CRH-R 1 CRHR1 Corticotropin-releasing factor receptor 1 (CRF-1) Corticotropin-releasing hormone receptor 1
Type:
Enzyme
Mol. Mass.:
50744.31
Organism:
Homo sapiens (Human)
Description:
P34998
Residue:
444
  
Inhibitor
Name:
BDBM50231911
Synonyms:
CHEMBL252301 | N-(2-(1H-imidazol-1-yl)ethyl)-1-(2-methoxy-4,6-dimethylphenyl)-3-methyl-N-propylisoquinolin-4-amine
Type:
Small organic molecule
Emp. Form.:
C27H32N4O
Mol. Mass.:
428.5692
SMILES:
CCCN(CCn1ccnc1)c1c(C)nc(-c2c(C)cc(C)cc2OC)c2ccccc12
: