Target
Parathyroid hormone/parathyroid hormone-related peptide receptor
Ligand
BDBM50269971
Substrate
Meas. Tech.
ChEMBL_505701 (CHEMBL944463)
EC50
155±n/a nM
Citation
 Carter, PHLiu, RQFoster, WRTamasi, JATebben, AJFavata, MStaal, ACvijic, MEFrench, MHDell, VApanovitch, DLei, MZhao, QCunningham, MDecicco, CPTrzaskos, JMFeyen, JH Discovery of a small molecule antagonist of the parathyroid hormone receptor by using an N-terminal parathyroid hormone peptide probe. Proc Natl Acad Sci U S A 104:6846-51 (2007)  
Target
Name:
Parathyroid hormone/parathyroid hormone-related peptide receptor
Synonyms:
PTH1R_RAT Parathyroid hormone/parathyroid hormone-related peptide receptor Pthr | Pthr1
Type:
Enzyme
Mol. Mass.:
66273.93
Organism:
Rattus norvegicus (Rat)
Description:
P25961
Residue:
591
  
Inhibitor
Name:
BDBM50269971
Synonyms:
Ala-Val-Ala-Glu-lle-Gln-Leu-Met-His-Gln-Har-Ala-Lys-Trp | CHEMBL514849
Type:
Small organic molecule
Emp. Form.:
C76H124N24O18S
Mol. Mass.:
1694.013
SMILES:
CC[C@H](C)[C@H](NC(=O)[C@H](CCC(O)=O)NC(=O)[C@H](C)NC(=O)[C@@H](NC(=O)[C@H](C)N)C(C)C)C(=O)N[C@@H](CCC(N)=O)C(=O)N[C@@H](CC(C)C)C(=O)N[C@@H](CCSC)C(=O)N[C@@H](Cc1cnc[nH]1)C(=O)N[C@@H](CCC(N)=O)C(=O)N[C@@H](CCCCN=C(N)N)C(=O)N[C@@H](C)C(=O)N[C@@H](CCCCN)C(=O)N[C@@H](Cc1c[nH]c2ccccc12)C(N)=O
: