Target
Parathyroid hormone/parathyroid hormone-related peptide receptor
Ligand
BDBM50269974
Substrate
Meas. Tech.
ChEMBL_505701 (CHEMBL944463)
EC50
344±n/a nM
Citation
 Carter, PHLiu, RQFoster, WRTamasi, JATebben, AJFavata, MStaal, ACvijic, MEFrench, MHDell, VApanovitch, DLei, MZhao, QCunningham, MDecicco, CPTrzaskos, JMFeyen, JH Discovery of a small molecule antagonist of the parathyroid hormone receptor by using an N-terminal parathyroid hormone peptide probe. Proc Natl Acad Sci U S A 104:6846-51 (2007)  
Target
Name:
Parathyroid hormone/parathyroid hormone-related peptide receptor
Synonyms:
PTH1R_RAT Parathyroid hormone/parathyroid hormone-related peptide receptor Pthr | Pthr1
Type:
Enzyme
Mol. Mass.:
66273.93
Organism:
Rattus norvegicus (Rat)
Description:
P25961
Residue:
591
  
Inhibitor
Name:
BDBM50269974
Synonyms:
Ala-Val-Ala-Glu-lle-Gln-Leu-Nle-His-Gln-Har-Ala-Lys-Tyr | CHEMBL450474
Type:
Small organic molecule
Emp. Form.:
C75H125N23O19
Mol. Mass.:
1652.9377
SMILES:
CCCC[C@H](NC(=O)[C@H](CC(C)C)NC(=O)[C@H](CCC(N)=O)NC(=O)[C@@H](NC(=O)[C@H](CCC(O)=O)NC(=O)[C@H](C)NC(=O)[C@@H](NC(=O)[C@H](C)N)C(C)C)[C@@H](C)CC)C(=O)N[C@@H](Cc1cnc[nH]1)C(=O)N[C@@H](CCC(N)=O)C(=O)N[C@@H](CCCCN=C(N)N)C(=O)N[C@@H](C)C(=O)N[C@@H](CCCCN)C(=O)N[C@@H](Cc1ccc(O)cc1)C(N)=O
: