Target
Substance-K receptor
Ligand
BDBM50269979
Substrate
Meas. Tech.
ChEMBL_505747 (CHEMBL945453)
IC50
28000±n/a nM
Citation
 Carter, PHLiu, RQFoster, WRTamasi, JATebben, AJFavata, MStaal, ACvijic, MEFrench, MHDell, VApanovitch, DLei, MZhao, QCunningham, MDecicco, CPTrzaskos, JMFeyen, JH Discovery of a small molecule antagonist of the parathyroid hormone receptor by using an N-terminal parathyroid hormone peptide probe. Proc Natl Acad Sci U S A 104:6846-51 (2007)  
Target
Name:
Substance-K receptor
Synonyms:
NK-2 receptor NK2R NKNAR Neurokinin A receptor Neurokinin-2 (NK-2) SKR TACR2 Tachykinin receptor 2 (NK2) | hnk-3
Type:
Protein
Mol. Mass.:
44455.78
Organism:
Homo sapiens (Human)
Description:
P21452
Residue:
398
  
Inhibitor
Name:
BDBM50269979
Synonyms:
CHEMBL515170 | r-5-(2-E-cyclopropylvinyl)-t-3-ethyl-6,7-difluoro-5-(trifluoromethyl)benzo[e][1,4]-oxazepin-2(1H,3H,5H)-one
Type:
Small organic molecule
Emp. Form.:
C17H16F5NO2
Mol. Mass.:
361.3065
SMILES:
CC[C@@H]1O[C@@](\C=C\C2CC2)(c2c(F)c(F)ccc2NC1=O)C(F)(F)F
: