Target
Xanthine dehydrogenase/oxidase
Ligand
BDBM50242765
Substrate
Meas. Tech.
ChEMBL_532316 (CHEMBL973239)
IC50
19580±n/a nM
Citation
 Gupta, SRodrigues, LMEsteves, APOliveira-Campos, AMNascimento, MSNazareth, NCidade, HNeves, MPFernandes, EPinto, MCerqueira, NMBrás, N Synthesis of N-aryl-5-amino-4-cyanopyrazole derivatives as potent xanthine oxidase inhibitors. Eur J Med Chem 43:771-80 (2008)  
Target
Name:
Xanthine dehydrogenase/oxidase
Synonyms:
XD XDHA XO Xanthine dehydrogenase/oxidase | Xanthine oxidase
Type:
Enzyme
Mol. Mass.:
146441.21
Organism:
Homo sapiens (Human)
Description:
P47989
Residue:
1333
  
Inhibitor
Name:
BDBM50242765
Synonyms:
(4'-Methoxyphenyl)-1H-pyrazolo[3,4-d]pyrimidin-4-ylamine | CHEMBL460873
Type:
Small organic molecule
Emp. Form.:
C12H11N5O
Mol. Mass.:
241.2486
SMILES:
COc1ccc(cc1)-n1ncc2c(N)ncnc12
: