Target
Gonadotropin-releasing hormone receptor
Ligand
BDBM50243901
Substrate
Meas. Tech.
ChEMBL_554180 (CHEMBL963637)
IC50
4500±n/a nM
Citation
 Pelletier, JCChengalvala, MCottom, JFeingold, IGarrick, LGreen, DHauze, DHuselton, CJetter, JKao, WKopf, GSLundquist, JTMann, CMehlmann, JRogers, JShanno, LWrobel, J 2-phenyl-4-piperazinylbenzimidazoles: orally active inhibitors of the gonadotropin releasing hormone (GnRH) receptor. Bioorg Med Chem 16:6617-40 (2008)  
Target
Name:
Gonadotropin-releasing hormone receptor
Synonyms:
GNRHR GRHR GnRH-R Gonadotropin-releasing hormone receptor | Gonadotropin-releasing hormone receptor (GnRH)
Type:
Enzyme
Mol. Mass.:
37749.45
Organism:
Homo sapiens (Human)
Description:
P30968
Residue:
328
  
Inhibitor
Name:
BDBM50243901
Synonyms:
5-(2-(4-(2-(Trifluoromethyl)-1H-benzo[d]imidazol-4-yl)piperazin-1-yl)ethoxy)-1H-benzo[d]imidazole-2(3H)-thione | CHEMBL488478
Type:
Small organic molecule
Emp. Form.:
C21H21F3N6OS
Mol. Mass.:
462.491
SMILES:
FC(F)(F)c1nc2c(cccc2[nH]1)N1CCN(CCOc2ccc3[nH]c(=S)[nH]c3c2)CC1
: