Target
5-hydroxytryptamine receptor 2A
Ligand
BDBM50244213
Substrate
Meas. Tech.
ChEMBL_554209 (CHEMBL963666)
Ki
230±n/a nM
Citation
 Pelletier, JCChengalvala, MCottom, JFeingold, IGarrick, LGreen, DHauze, DHuselton, CJetter, JKao, WKopf, GSLundquist, JTMann, CMehlmann, JRogers, JShanno, LWrobel, J 2-phenyl-4-piperazinylbenzimidazoles: orally active inhibitors of the gonadotropin releasing hormone (GnRH) receptor. Bioorg Med Chem 16:6617-40 (2008)  
Target
Name:
5-hydroxytryptamine receptor 2A
Synonyms:
5-HT-2 5-HT2A 5-hydroxytryptamine receptor 2A (5HT-2A) 5HT2A_HUMAN HTR2A | Serotonin receptor 2A
Type:
undefined
Mol. Mass.:
52607.65
Organism:
Homo sapiens (Human)
Description:
P28223
Residue:
471
  
Inhibitor
Name:
BDBM50244213
Synonyms:
5-((4-(2-(4-tert-butylphenyl)-1H-benzo[d]imidazol-4-yl)piperazin-1-yl)methyl)-1-ethylpyrimidine-2,4(1H,3H)-dione | CHEMBL460480
Type:
Small organic molecule
Emp. Form.:
C28H34N6O2
Mol. Mass.:
486.6086
SMILES:
CCn1cc(CN2CCN(CC2)c2cccc3[nH]c(nc23)-c2ccc(cc2)C(C)(C)C)c(=O)[nH]c1=O
: