Target
Beta-3 adrenergic receptor
Ligand
BDBM50243113
Substrate
Meas. Tech.
ChEMBL_487337 (CHEMBL1021863)
EC50
3.2±n/a nM
Citation
 Imanishi, MItou, SWashizuka, KHamashima, HNakajima, YAraki, TTomishima, YSakurai, MMatsui, SImamura, EUeshima, KYamamoto, TYamamoto, NIshikawa, HNakano, KUnami, NHamada, KMatsumura, YTakamura, FHattori, K Discovery of a novel series of biphenyl benzoic acid derivatives as highly potent and selective human beta3 adrenergic receptor agonists with good oral bioavailability. Part II. J Med Chem 51:4002-20 (2008)  
Target
Name:
Beta-3 adrenergic receptor
Synonyms:
ADRB3 B3AR
Type:
PROTEIN
Mol. Mass.:
43072.49
Organism:
Canis familiaris
Description:
ChEMBL_497812
Residue:
405
  
Inhibitor
Name:
BDBM50243113
Synonyms:
4-(2-{[(2R)-2-(6-Amino-3-pyridinyl)-2-hydroxyethyl]amino}ethyl)-3-isobutyl-4-biphenylcarboxylic acid | CHEMBL487682
Type:
Small organic molecule
Emp. Form.:
C26H31N3O3
Mol. Mass.:
433.5426
SMILES:
CC(C)Cc1cc(ccc1C(O)=O)-c1ccc(CCNC[C@H](O)c2ccc(N)nc2)cc1
: