Target
Beta-1 adrenergic receptor
Ligand
BDBM50242908
Substrate
Meas. Tech.
ChEMBL_492275 (CHEMBL947243)
EC50
>1000±n/a nM
Citation
 Imanishi, MItou, SWashizuka, KHamashima, HNakajima, YAraki, TTomishima, YSakurai, MMatsui, SImamura, EUeshima, KYamamoto, TYamamoto, NIshikawa, HNakano, KUnami, NHamada, KMatsumura, YTakamura, FHattori, K Discovery of a novel series of biphenyl benzoic acid derivatives as highly potent and selective human beta3 adrenergic receptor agonists with good oral bioavailability. Part II. J Med Chem 51:4002-20 (2008)  
Target
Name:
Beta-1 adrenergic receptor
Synonyms:
ADRB1 ADRB1_HUMAN Beta-1 adrenoceptor adrenergic Beta1
Type:
G Protein-Coupled Receptor (GPCR)
Mol. Mass.:
51338.40
Organism:
Homo sapiens (Human)
Description:
P08588
Residue:
477
  
Inhibitor
Name:
BDBM50242908
Synonyms:
4-(2-{[(2R)-2-(3-Methansulfonylaminophenyl)-2-hydroxyethyl]-amino}ethyl)-3-isopropoxy-4-biphenylcarboxylic acid | CHEMBL472105
Type:
Small organic molecule
Emp. Form.:
C27H32N2O6S
Mol. Mass.:
512.618
SMILES:
CC(C)Oc1cc(ccc1C(O)=O)-c1ccc(CCNC[C@H](O)c2cccc(NS(C)(=O)=O)c2)cc1
: