Target
Beta-2 adrenergic receptor
Ligand
BDBM50236185
Substrate
Meas. Tech.
ChEMBL_497790 (CHEMBL1007086)
EC50
>1000±n/a nM
Citation
 Hattori, KToda, SImanishi, MItou, SNakajima, YWashizuka, KAraki, THamashima, HTomishima, YSakurai, MMatsui, SImamura, EUeshima, KYamamoto, TYamamoto, NIshikawa, HNakano, KUnami, NHamada, KMatsumura, YTakamura, F Discovery of highly potent and selective biphenylacylsulfonamide-based beta3-adrenergic receptor agonists and evaluation of physical properties as potential overactive bladder therapies: part 5. J Med Chem 52:3063-72 (2009)  
Target
Name:
Beta-2 adrenergic receptor
Synonyms:
ADRB2 ADRB2_HUMAN Beta-2 adrenoceptor | Beta-2 adrenoreceptor
Type:
Mol. Mass.:
46461.69
Organism:
Homo sapiens (Human)
Description:
P07550
Residue:
413
  
Inhibitor
Name:
BDBM50236185
Synonyms:
(R)-4'-(2-(2-hydroxy-2-phenylethylamino)ethyl)-3-isopropoxybiphenyl-4-carboxylic acid 4-(2-{[(2R)-2-hydroxy-2-phenylethyl]amino}ethyl)-3-isopropoxy-4-biphenylcarboxylic acid | CHEMBL271945
Type:
Small organic molecule
Emp. Form.:
C26H29NO4
Mol. Mass.:
419.5128
SMILES:
CC(C)Oc1cc(ccc1C(O)=O)-c1ccc(CCNC[C@H](O)c2ccccc2)cc1
: