Target
Beta-2 adrenergic receptor
Ligand
BDBM50277527
Substrate
Meas. Tech.
ChEMBL_497790 (CHEMBL1007086)
EC50
1100±n/a nM
Citation
 Hattori, KToda, SImanishi, MItou, SNakajima, YWashizuka, KAraki, THamashima, HTomishima, YSakurai, MMatsui, SImamura, EUeshima, KYamamoto, TYamamoto, NIshikawa, HNakano, KUnami, NHamada, KMatsumura, YTakamura, F Discovery of highly potent and selective biphenylacylsulfonamide-based beta3-adrenergic receptor agonists and evaluation of physical properties as potential overactive bladder therapies: part 5. J Med Chem 52:3063-72 (2009)  
Target
Name:
Beta-2 adrenergic receptor
Synonyms:
ADRB2 ADRB2_HUMAN Beta-2 adrenoceptor | Beta-2 adrenoreceptor
Type:
Mol. Mass.:
46461.69
Organism:
Homo sapiens (Human)
Description:
P07550
Residue:
413
  
Inhibitor
Name:
BDBM50277527
Synonyms:
(R)-4'-(2-(2-(4-aminopyridin-3-yl)-2-hydroxyethylamino)ethyl)-3-(cyclohexyloxy)biphenyl-4-carboxylic acid | CHEMBL470857
Type:
Small organic molecule
Emp. Form.:
C28H33N3O4
Mol. Mass.:
475.5793
SMILES:
Nc1ccncc1[C@@H](O)CNCCc1ccc(cc1)-c1ccc(C(O)=O)c(OC2CCCCC2)c1
: