Target
Beta-3 adrenergic receptor
Ligand
BDBM50243112
Substrate
Meas. Tech.
ChEMBL_497812 (CHEMBL1007108)
EC50
1.3±n/a nM
Citation
 Hattori, KToda, SImanishi, MItou, SNakajima, YWashizuka, KAraki, THamashima, HTomishima, YSakurai, MMatsui, SImamura, EUeshima, KYamamoto, TYamamoto, NIshikawa, HNakano, KUnami, NHamada, KMatsumura, YTakamura, F Discovery of highly potent and selective biphenylacylsulfonamide-based beta3-adrenergic receptor agonists and evaluation of physical properties as potential overactive bladder therapies: part 5. J Med Chem 52:3063-72 (2009)  
Target
Name:
Beta-3 adrenergic receptor
Synonyms:
ADRB3 B3AR
Type:
PROTEIN
Mol. Mass.:
43072.49
Organism:
Canis familiaris
Description:
ChEMBL_497812
Residue:
405
  
Inhibitor
Name:
BDBM50243112
Synonyms:
(R)-3-(cyclohexyloxy)-4'-(2-(2-hydroxy-2-(pyridin-3-yl)ethylamino)ethyl)biphenyl-4-carboxylic acid CHEMBL488224
Type:
Small organic molecule
Emp. Form.:
C28H32N2O4
Mol. Mass.:
460.5647
SMILES:
O[C@@H](CNCCc1ccc(cc1)-c1ccc(C(O)=O)c(OC2CCCCC2)c1)c1cccnc1
: