Target
Beta-1 adrenergic receptor
Ligand
BDBM50277532
Substrate
Meas. Tech.
ChEMBL_497789 (CHEMBL1007085)
EC50
>1000±n/a nM
Citation
 Hattori, KToda, SImanishi, MItou, SNakajima, YWashizuka, KAraki, THamashima, HTomishima, YSakurai, MMatsui, SImamura, EUeshima, KYamamoto, TYamamoto, NIshikawa, HNakano, KUnami, NHamada, KMatsumura, YTakamura, F Discovery of highly potent and selective biphenylacylsulfonamide-based beta3-adrenergic receptor agonists and evaluation of physical properties as potential overactive bladder therapies: part 5. J Med Chem 52:3063-72 (2009)  
Target
Name:
Beta-1 adrenergic receptor
Synonyms:
ADRB1 ADRB1_HUMAN Beta-1 adrenoceptor adrenergic Beta1
Type:
G Protein-Coupled Receptor (GPCR)
Mol. Mass.:
51338.40
Organism:
Homo sapiens (Human)
Description:
P08588
Residue:
477
  
Inhibitor
Name:
BDBM50277532
Synonyms:
3-Cyclopentyl-4'-(2-{[(2R)-2-hydroxy-2-phenylethyl]amino}ethyl)-N-(methylsulfonyl)biphenyl-4-carboxamide Hydrochloride | CHEMBL511968
Type:
Small organic molecule
Emp. Form.:
C29H34N2O4S
Mol. Mass.:
506.656
SMILES:
CS(=O)(=O)NC(=O)c1ccc(cc1C1CCCC1)-c1ccc(CCNC[C@H](O)c2ccccc2)cc1
: