Target
Beta-1 adrenergic receptor
Ligand
BDBM50277529
Substrate
Meas. Tech.
ChEMBL_497789 (CHEMBL1007085)
EC50
260±n/a nM
Citation
 Hattori, KToda, SImanishi, MItou, SNakajima, YWashizuka, KAraki, THamashima, HTomishima, YSakurai, MMatsui, SImamura, EUeshima, KYamamoto, TYamamoto, NIshikawa, HNakano, KUnami, NHamada, KMatsumura, YTakamura, F Discovery of highly potent and selective biphenylacylsulfonamide-based beta3-adrenergic receptor agonists and evaluation of physical properties as potential overactive bladder therapies: part 5. J Med Chem 52:3063-72 (2009)  
Target
Name:
Beta-1 adrenergic receptor
Synonyms:
ADRB1 ADRB1_HUMAN Beta-1 adrenoceptor adrenergic Beta1
Type:
G Protein-Coupled Receptor (GPCR)
Mol. Mass.:
51338.40
Organism:
Homo sapiens (Human)
Description:
P08588
Residue:
477
  
Inhibitor
Name:
BDBM50277529
Synonyms:
4'-(2-{[(2R)-2-Hydroxy-2-phenylethyl]amino}ethyl)-3-(isopropylamino)-N-(methylsulfonyl)biphenyl-4-carboxamide Dihydrochloride | CHEMBL471060
Type:
Small organic molecule
Emp. Form.:
C27H33N3O4S
Mol. Mass.:
495.634
SMILES:
CC(C)Nc1cc(ccc1C(=O)NS(C)(=O)=O)-c1ccc(CCNC[C@H](O)c2ccccc2)cc1
: