Target
Beta-1 adrenergic receptor
Ligand
BDBM50277477
Substrate
Meas. Tech.
ChEMBL_497789 (CHEMBL1007085)
EC50
160±n/a nM
Citation
 Hattori, KToda, SImanishi, MItou, SNakajima, YWashizuka, KAraki, THamashima, HTomishima, YSakurai, MMatsui, SImamura, EUeshima, KYamamoto, TYamamoto, NIshikawa, HNakano, KUnami, NHamada, KMatsumura, YTakamura, F Discovery of highly potent and selective biphenylacylsulfonamide-based beta3-adrenergic receptor agonists and evaluation of physical properties as potential overactive bladder therapies: part 5. J Med Chem 52:3063-72 (2009)  
Target
Name:
Beta-1 adrenergic receptor
Synonyms:
ADRB1 ADRB1_HUMAN Beta-1 adrenoceptor adrenergic Beta1
Type:
G Protein-Coupled Receptor (GPCR)
Mol. Mass.:
51338.40
Organism:
Homo sapiens (Human)
Description:
P08588
Residue:
477
  
Inhibitor
Name:
BDBM50277477
Synonyms:
4'-(2-{[(2R)-2-Hydroxy-2-phenylethyl]amino}ethyl)-N-(methylsulfonyl)-3-(pentyloxy)biphenyl-4-carboxamide Hydrochloride | CHEMBL472089
Type:
Small organic molecule
Emp. Form.:
C29H36N2O5S
Mol. Mass.:
524.672
SMILES:
CCCCCOc1cc(ccc1C(=O)NS(C)(=O)=O)-c1ccc(CCNC[C@H](O)c2ccccc2)cc1
: