Target
Beta-3 adrenergic receptor
Ligand
BDBM50277476
Substrate
Meas. Tech.
ChEMBL_497791 (CHEMBL1007087)
EC50
3.1±n/a nM
Citation
 Hattori, KToda, SImanishi, MItou, SNakajima, YWashizuka, KAraki, THamashima, HTomishima, YSakurai, MMatsui, SImamura, EUeshima, KYamamoto, TYamamoto, NIshikawa, HNakano, KUnami, NHamada, KMatsumura, YTakamura, F Discovery of highly potent and selective biphenylacylsulfonamide-based beta3-adrenergic receptor agonists and evaluation of physical properties as potential overactive bladder therapies: part 5. J Med Chem 52:3063-72 (2009)  
Target
Name:
Beta-3 adrenergic receptor
Synonyms:
ADRB3 ADRB3_HUMAN Beta-2 adrenergic receptor and beta-3 adrenergic receptor Beta-3 adrenoreceptor | adrenergic Beta3
Type:
G Protein-Coupled Receptor (GPCR)
Mol. Mass.:
43534.88
Organism:
Homo sapiens (Human)
Description:
Residue:
408
  
Inhibitor
Name:
BDBM50277476
Synonyms:
4'-(2-{[(2R)-2-Hydroxy-2-phenylethyl]amino}ethyl)-3-isopropoxy-N-(methylsulfonyl)biphenyl-4-carboxamide Hydrochloride | CHEMBL515397
Type:
Small organic molecule
Emp. Form.:
C27H32N2O5S
Mol. Mass.:
496.618
SMILES:
CC(C)Oc1cc(ccc1C(=O)NS(C)(=O)=O)-c1ccc(CCNC[C@H](O)c2ccccc2)cc1
: