Target
Beta-1 adrenergic receptor
Ligand
BDBM50236181
Substrate
Meas. Tech.
ChEMBL_497789 (CHEMBL1007085)
EC50
>1000±n/a nM
Citation
 Hattori, KToda, SImanishi, MItou, SNakajima, YWashizuka, KAraki, THamashima, HTomishima, YSakurai, MMatsui, SImamura, EUeshima, KYamamoto, TYamamoto, NIshikawa, HNakano, KUnami, NHamada, KMatsumura, YTakamura, F Discovery of highly potent and selective biphenylacylsulfonamide-based beta3-adrenergic receptor agonists and evaluation of physical properties as potential overactive bladder therapies: part 5. J Med Chem 52:3063-72 (2009)  
Target
Name:
Beta-1 adrenergic receptor
Synonyms:
ADRB1 ADRB1_HUMAN Beta-1 adrenoceptor adrenergic Beta1
Type:
G Protein-Coupled Receptor (GPCR)
Mol. Mass.:
51338.40
Organism:
Homo sapiens (Human)
Description:
P08588
Residue:
477
  
Inhibitor
Name:
BDBM50236181
Synonyms:
(R)-4'-(2-(2-hydroxy-2-phenylethylamino)ethyl)-3-isobutylbiphenyl-4-carboxylic acid 4-(2-{[(2R)-2-hydroxy-2-phenylethyl]amino}ethyl)-10-isobutyl-4-biphenylcarboxylic acid | CHEMBL270026
Type:
Small organic molecule
Emp. Form.:
C27H31NO3
Mol. Mass.:
417.5399
SMILES:
CC(C)Cc1cc(ccc1C(O)=O)-c1ccc(CCNC[C@H](O)c2ccccc2)cc1
: