Target
Type-2 angiotensin II receptor
Ligand
BDBM50032364
Substrate
Meas. Tech.
ChEBML_35434
IC50
3±n/a nM
Citation
 Quan, MLOlson, RECarini, DJEllis, CDHillyer, GLLalka, GKLiu, JVanAtten, MKChiu, ATWong, PCWexler, RRTimmermans, PB Balanced angiotensin II receptor antagonists. I. The effects of biphenyl “ortho”-substitution on AT1/AT2 affinities Bioorg Med Chem Lett 4:2011-2016 (1994)    Article 
Target
Name:
Type-2 angiotensin II receptor
Synonyms:
AGTR2_RAT Agtr2 Angiotensin II receptor Type-2 angiotensin II receptor
Type:
Enzyme Catalytic Domain
Mol. Mass.:
41346.62
Organism:
RAT
Description:
Angiotensin II AT2 0 0::P35351
Residue:
363
  
Inhibitor
Name:
BDBM50032364
Synonyms:
4'-(5-Acetyl-4-ethyl-2-propyl-imidazol-1-ylmethyl)-3'-fluoro-biphenyl-2-sulfonic acid N-(butyloxycarbonyl)amide CHEMBL60942 | butyloxy 2-{2-[3-flouoro-4-(4-ethyl-5-methyloxycarbonyl-2-propyl-1H-1-imidazolylmethyl)phenyl]phenylsulfonyl}carbonylamino
Type:
Small organic molecule
Emp. Form.:
C28H34FN3O5S
Mol. Mass.:
543.65
SMILES:
CCCCOC(=O)NS(=O)(=O)c1ccccc1-c1ccc(Cn2c(CCC)nc(CC)c2C(C)=O)c(F)c1
: