Target
Type-1 angiotensin II receptor A/B
Ligand
BDBM50032364
Substrate
Meas. Tech.
ChEMBL_34956 (CHEMBL647799)
IC50
1±n/a nM
Citation
 Quan, MLOlson, RECarini, DJEllis, CDHillyer, GLLalka, GKLiu, JVanAtten, MKChiu, ATWong, PCWexler, RRTimmermans, PB Balanced angiotensin II receptor antagonists. I. The effects of biphenyl “ortho”-substitution on AT1/AT2 affinities Bioorg Med Chem Lett 4:2011-2016 (1994)    Article 
Target
Name:
Type-1 angiotensin II receptor A/B
Synonyms:
Angiotensin II receptor (AT-1) type-1 | Type-1A/Type-1B angiotensin II receptor
Type:
Mol. Mass.:
Description:
ASSAY_ID of ChEMBL is 901964
Components:
This complex has 2 components.
Component 1
Name:
Type-1 angiotensin II receptor B
Synonyms:
AGTRB_RAT Agtr1 Angiotensin II AT1B Angiotensin II type 1b (AT-1b) receptor Type-1B angiotensin II receptor
Type:
Enzyme Catalytic Domain
Mol. Mass.:
40929.44
Organism:
RAT
Description:
Angiotensin II AT1B 0 RAT::P29089
Residue:
359
  
Component 2
Name:
Type-1 angiotensin II receptor A
Synonyms:
AGTRA_RAT Agtr1 Angiotensin II AT1 Angiotensin II receptor (AT-1) type-1 Type-1A angiotensin II receptor
Type:
Enzyme Catalytic Domain
Mol. Mass.:
40910.53
Organism:
RAT
Description:
ANGIOTENSIN AT1 AGTR1 RAT::P25095
Residue:
359
  
Inhibitor
Name:
BDBM50032364
Synonyms:
4'-(5-Acetyl-4-ethyl-2-propyl-imidazol-1-ylmethyl)-3'-fluoro-biphenyl-2-sulfonic acid N-(butyloxycarbonyl)amide CHEMBL60942 | butyloxy 2-{2-[3-flouoro-4-(4-ethyl-5-methyloxycarbonyl-2-propyl-1H-1-imidazolylmethyl)phenyl]phenylsulfonyl}carbonylamino
Type:
Small organic molecule
Emp. Form.:
C28H34FN3O5S
Mol. Mass.:
543.65
SMILES:
CCCCOC(=O)NS(=O)(=O)c1ccccc1-c1ccc(Cn2c(CCC)nc(CC)c2C(C)=O)c(F)c1
: