Target
Type-2 angiotensin II receptor
Ligand
BDBM82433
Substrate
Meas. Tech.
ChEBML_35442
IC50
0.700000±n/a nM
Citation
 Glinka, TWde Laszlo, SESiegl, PKChang, RSKivlighn, SDSchorn, TSFaust, KAChen, TBZingaro, GJLotti, VJGreenlee, WJ Development of angiotensin II antagonists with equipotent affinity for human AT1 and AT2 receptor subtypes. Bioorg Med Chem Lett 4:2337-2342 (1994)    Article 
Target
Name:
Type-2 angiotensin II receptor
Synonyms:
AGTR2_RAT Agtr2 Angiotensin II receptor Type-2 angiotensin II receptor
Type:
Enzyme Catalytic Domain
Mol. Mass.:
41346.62
Organism:
RAT
Description:
Angiotensin II AT2 0 0::P35351
Residue:
363
  
Inhibitor
Name:
BDBM82433
Synonyms:
CHEMBL302102 L-159689 | N-Pentyl-N-[[2-propyl-3-[[2'-(1H-tetrazol-5-yl)biphenyl-4-yl]methyl]-3,4-dihydro-4-oxoquinazolin]-6-yl]benzamide
Type:
Small organic molecule
Emp. Form.:
C37H37N7O2
Mol. Mass.:
611.7354
SMILES:
CCCCCN(C(=O)c1ccccc1)c1ccc2nc(CCC)n(Cc3ccc(cc3)-c3ccccc3-c3nnn[nH]3)c(=O)c2c1
: