Target
Serine protease 1
Ligand
BDBM50288450
Substrate
Meas. Tech.
ChEBML_212504
Ki
66±n/a nM
Citation
 Greco, MNPowell, ETHecker, LRAndrade-Gordon, PKauffman, JALewis, JMGanesh, VTulinsky, AMaryanoff, BE Novel thrombin inhibitors that are based on a macrocyclic tripeptide motif Bioorg Med Chem Lett 6:2947-2952 (1996)    Article 
Target
Name:
Serine protease 1
Synonyms:
Beta-Trypsin PRSS1 TRY1 TRYP1 Trypsin I
Type:
Enzyme
Mol. Mass.:
25790.52
Organism:
Bos taurus (bovine)
Description:
P00760
Residue:
246
  
Inhibitor
Name:
BDBM50288450
Synonyms:
CHEMBL328200 | N-[3-((6S,19R,21aR)-6-Benzyl-5,8,17,18,21-pentaoxo-docosahydro-4a,7,16,20-tetraaza-benzocyclononadecen-19-yl)-propyl]-guanidine
Type:
Small organic molecule
Emp. Form.:
C30H45N7O5
Mol. Mass.:
583.7222
SMILES:
NC(=N)NCCC[C@H]1NC(=O)[C@H]2CCCCN2C(=O)[C@H](Cc2ccccc2)NC(=O)CCCCCCCNC(=O)C1=O
: