Target
Serine protease 1
Ligand
BDBM50288453
Substrate
Meas. Tech.
ChEBML_212504
Ki
5.2±n/a nM
Citation
 Greco, MNPowell, ETHecker, LRAndrade-Gordon, PKauffman, JALewis, JMGanesh, VTulinsky, AMaryanoff, BE Novel thrombin inhibitors that are based on a macrocyclic tripeptide motif Bioorg Med Chem Lett 6:2947-2952 (1996)    Article 
Target
Name:
Serine protease 1
Synonyms:
Beta-Trypsin PRSS1 TRY1 TRYP1 Trypsin I
Type:
Enzyme
Mol. Mass.:
25790.52
Organism:
Bos taurus (bovine)
Description:
P00760
Residue:
246
  
Inhibitor
Name:
BDBM50288453
Synonyms:
CHEMBL317353 | N-[3-((5S,15S,19R,21aR)-5-Benzyl-4,7,14,17,18,21-hexaoxo-15-phenethyl-docosahydro-3a,6,13,16,20-pentaaza-cyclopentacycloicosen-19-yl)-propyl]-guanidine
Type:
Small organic molecule
Emp. Form.:
C37H50N8O6
Mol. Mass.:
702.8429
SMILES:
NC(=N)NCCC[C@H]1NC(=O)[C@H]2CCCN2C(=O)[C@H](Cc2ccccc2)NC(=O)CCCCCNC(=O)[C@H](CCc2ccccc2)NC(=O)C1=O
: