Target
Prothrombin
Ligand
BDBM50288450
Substrate
Meas. Tech.
ChEBML_208327
Ki
86±n/a nM
Citation
 Greco, MNPowell, ETHecker, LRAndrade-Gordon, PKauffman, JALewis, JMGanesh, VTulinsky, AMaryanoff, BE Novel thrombin inhibitors that are based on a macrocyclic tripeptide motif Bioorg Med Chem Lett 6:2947-2952 (1996)    Article 
Target
Name:
Prothrombin
Synonyms:
Activation peptide fragment 1 Coagulation factor II Prothrombin precursor Thrombin heavy chain | Thrombin light chain
Type:
Protein
Mol. Mass.:
70029.57
Organism:
Homo sapiens (Human)
Description:
P00734
Residue:
622
  
Inhibitor
Name:
BDBM50288450
Synonyms:
CHEMBL328200 | N-[3-((6S,19R,21aR)-6-Benzyl-5,8,17,18,21-pentaoxo-docosahydro-4a,7,16,20-tetraaza-benzocyclononadecen-19-yl)-propyl]-guanidine
Type:
Small organic molecule
Emp. Form.:
C30H45N7O5
Mol. Mass.:
583.7222
SMILES:
NC(=N)NCCC[C@H]1NC(=O)[C@H]2CCCCN2C(=O)[C@H](Cc2ccccc2)NC(=O)CCCCCCCNC(=O)C1=O
: