Target
Serine protease 1
Ligand
BDBM50288455
Substrate
Meas. Tech.
ChEBML_212504
Ki
25±n/a nM
Citation
 Greco, MNPowell, ETHecker, LRAndrade-Gordon, PKauffman, JALewis, JMGanesh, VTulinsky, AMaryanoff, BE Novel thrombin inhibitors that are based on a macrocyclic tripeptide motif Bioorg Med Chem Lett 6:2947-2952 (1996)    Article 
Target
Name:
Serine protease 1
Synonyms:
Beta-Trypsin PRSS1 TRY1 TRYP1 Trypsin I
Type:
Enzyme
Mol. Mass.:
25790.52
Organism:
Bos taurus (bovine)
Description:
P00760
Residue:
246
  
Inhibitor
Name:
BDBM50288455
Synonyms:
CHEMBL100712 | N-[3-((5S,21R,23aR)-5-Benzyl-4,7,19,20,23-pentaoxo-tetracosahydro-3a,6,18,22-tetraaza-cyclopentacyclodocosen-21-yl)-propyl]-guanidine
Type:
Small organic molecule
Emp. Form.:
C32H49N7O5
Mol. Mass.:
611.7754
SMILES:
NC(=N)NCCC[C@H]1NC(=O)[C@H]2CCCN2C(=O)[C@H](Cc2ccccc2)NC(=O)CCCCCCCCCCNC(=O)C1=O
: