Target
Serine protease 1
Ligand
BDBM50288460
Substrate
Meas. Tech.
ChEBML_212504
Ki
10±n/a nM
Citation
 Greco, MNPowell, ETHecker, LRAndrade-Gordon, PKauffman, JALewis, JMGanesh, VTulinsky, AMaryanoff, BE Novel thrombin inhibitors that are based on a macrocyclic tripeptide motif Bioorg Med Chem Lett 6:2947-2952 (1996)    Article 
Target
Name:
Serine protease 1
Synonyms:
Beta-Trypsin PRSS1 TRY1 TRYP1 Trypsin I
Type:
Enzyme
Mol. Mass.:
25790.52
Organism:
Bos taurus (bovine)
Description:
P00760
Residue:
246
  
Inhibitor
Name:
BDBM50288460
Synonyms:
CHEMBL101049 | N-[3-((5S,18R,20aR)-5-Benzyl-4,7,16,17,20-pentaoxo-icosahydro-3a,6,15,19-tetraaza-cyclopentacyclononadecen-18-yl)-propyl]-guanidine
Type:
Small organic molecule
Emp. Form.:
C29H43N7O5
Mol. Mass.:
569.6956
SMILES:
NC(=N)NCCC[C@H]1NC(=O)[C@H]2CCCN2C(=O)[C@H](Cc2ccccc2)NC(=O)CCCCCCCNC(=O)C1=O
: