Target
Prothrombin
Ligand
BDBM50288461
Substrate
Meas. Tech.
ChEBML_208327
Ki
473±n/a nM
Citation
 Greco, MNPowell, ETHecker, LRAndrade-Gordon, PKauffman, JALewis, JMGanesh, VTulinsky, AMaryanoff, BE Novel thrombin inhibitors that are based on a macrocyclic tripeptide motif Bioorg Med Chem Lett 6:2947-2952 (1996)    Article 
Target
Name:
Prothrombin
Synonyms:
Activation peptide fragment 1 Coagulation factor II Prothrombin precursor Thrombin heavy chain | Thrombin light chain
Type:
Protein
Mol. Mass.:
70029.57
Organism:
Homo sapiens (Human)
Description:
P00734
Residue:
622
  
Inhibitor
Name:
BDBM50288461
Synonyms:
CHEMBL98856 | N-[3-((5S,16R,18aR)-5-Benzyl-4,7,14,15,18-pentaoxo-octadecahydro-3a,6,13,17-tetraaza-cyclopentacycloheptadecen-16-yl)-propyl]-guanidine
Type:
Small organic molecule
Emp. Form.:
C27H39N7O5
Mol. Mass.:
541.6425
SMILES:
NC(=N)NCCC[C@H]1NC(=O)[C@H]2CCCN2C(=O)[C@H](Cc2ccccc2)NC(=O)CCCCCNC(=O)C1=O
: