Target
Prothrombin
Ligand
BDBM50288459
Substrate
Meas. Tech.
ChEBML_208327
Ki
159±n/a nM
Citation
 Greco, MNPowell, ETHecker, LRAndrade-Gordon, PKauffman, JALewis, JMGanesh, VTulinsky, AMaryanoff, BE Novel thrombin inhibitors that are based on a macrocyclic tripeptide motif Bioorg Med Chem Lett 6:2947-2952 (1996)    Article 
Target
Name:
Prothrombin
Synonyms:
Activation peptide fragment 1 Coagulation factor II Prothrombin precursor Thrombin heavy chain | Thrombin light chain
Type:
Protein
Mol. Mass.:
70029.57
Organism:
Homo sapiens (Human)
Description:
P00734
Residue:
622
  
Inhibitor
Name:
BDBM50288459
Synonyms:
CHEMBL317428 | N-[3-((5S,18R,20aR)-5-Benzyl-2-methoxy-4,7,16,17,20-pentaoxo-icosahydro-3a,6,15,19-tetraaza-cyclopentacyclononadecen-18-yl)-propyl]-guanidine
Type:
Small organic molecule
Emp. Form.:
C30H45N7O6
Mol. Mass.:
599.7216
SMILES:
COC1C[C@H]2N(C1)C(=O)[C@H](Cc1ccccc1)NC(=O)CCCCCCCNC(=O)C(=O)[C@@H](CCCNC(N)=N)NC2=O
: