Target
Serine protease 1
Ligand
BDBM50288458
Substrate
Meas. Tech.
ChEBML_212504
Ki
11±n/a nM
Citation
 Greco, MNPowell, ETHecker, LRAndrade-Gordon, PKauffman, JALewis, JMGanesh, VTulinsky, AMaryanoff, BE Novel thrombin inhibitors that are based on a macrocyclic tripeptide motif Bioorg Med Chem Lett 6:2947-2952 (1996)    Article 
Target
Name:
Serine protease 1
Synonyms:
Beta-Trypsin PRSS1 TRY1 TRYP1 Trypsin I
Type:
Enzyme
Mol. Mass.:
25790.52
Organism:
Bos taurus (bovine)
Description:
P00760
Residue:
246
  
Inhibitor
Name:
BDBM50288458
Synonyms:
CHEMBL431429 | N-[3-((5S,18R,20aR)-4,7,16,17,20-Pentaoxo-5-phenyl-icosahydro-3a,6,15,19-tetraaza-cyclopentacyclononadecen-18-yl)-propyl]-guanidine
Type:
Small organic molecule
Emp. Form.:
C28H41N7O5
Mol. Mass.:
555.669
SMILES:
NC(=N)NCCC[C@H]1NC(=O)[C@H]2CCCN2C(=O)[C@@H](NC(=O)CCCCCCCNC(=O)C1=O)c1ccccc1
: