Target
Peroxisome proliferator-activated receptor gamma
Ligand
BDBM50295044
Substrate
Meas. Tech.
ChEMBL_573966 (CHEMBL1062956)
IC50
190±n/a nM
Citation
 Gorczynski, MJSmitherman, PKAkiyama, TEWood, HBBerger, JPKing, SBMorrow, CS Activation of peroxisome proliferator-activated receptor gamma (PPARgamma) by nitroalkene fatty acids: importance of nitration position and degree of unsaturation. J Med Chem 52:4631-9 (2009)  
Target
Name:
Peroxisome proliferator-activated receptor gamma
Synonyms:
NR1C3 PPAR-gamma PPARG_HUMAN Peroxisome proliferator-activated receptor gamma (PPAR gamma) Peroxisome proliferator-activated receptor gamma (PPARĪ³) peroxisome proliferator-activated receptor gamma isoform 2
Type:
Nuclear Receptor
Mol. Mass.:
57613.46
Organism:
Homo sapiens (Human)
Description:
P37231
Residue:
505
  
Inhibitor
Name:
BDBM50295044
Synonyms:
(E)-13-Nitrooctadec-12-enoic Acid | CHEMBL540732
Type:
Small organic molecule
Emp. Form.:
C18H33NO4
Mol. Mass.:
327.4589
SMILES:
CCCCC\C(=C/CCCCCCCCCCC(O)=O)[N+]([O-])=O
: