Target
Histamine H3 receptor
Ligand
BDBM50317871
Substrate
Meas. Tech.
ChEMBL_629959 (CHEMBL1112036)
Ki
56±n/a nM
Citation
 Ishikawa, MShinei, RYokoyama, FYamauchi, MOyama, MOkuma, KNagayama, TKato, KKakui, NSato, Y Role of hydrophobic substituents on the terminal nitrogen of histamine in receptor binding and agonist activity: development of an orally active histamine type 3 receptor agonist and evaluation of its antistress activity in mice. J Med Chem 53:3840-4 (2010)  
Target
Name:
Histamine H3 receptor
Synonyms:
G-protein coupled receptor 97 HH3R HRH3 Histamine H3 receptor (H3) Histamine receptor (H3 and H4)
Type:
G Protein-Coupled Receptor (GPCR)
Mol. Mass.:
48691.47
Organism:
Homo sapiens (Human)
Description:
Binding assays were using CHO cells stably expressing hH3R receptors.
Residue:
445
  
Inhibitor
Name:
BDBM50317871
Synonyms:
4-(2-(Phenylamino)ethyl)-1H-imidazole | CHEMBL1096514
Type:
Small organic molecule
Emp. Form.:
C11H13N3
Mol. Mass.:
187.241
SMILES:
C(Cc1cnc[nH]1)Nc1ccccc1
: