Target
Cytochrome P450 2C9
Ligand
BDBM50331168
Substrate
Meas. Tech.
ChEMBL_686355 (CHEMBL1293111)
IC50
>10000000±n/a nM
Citation
 Hadden, MDeering, DMHenderson, AJSurman, MDLuche, MKhmelnitsky, YVickers, SViggers, JCheetham, SGuzzo, PR Synthesis and SAR of 4-aryl-1-(indazol-5-yl)pyridin-2(1H)ones as MCH-1 antagonists for the treatment of obesity. Bioorg Med Chem Lett 20:7020-3 (2010)  
Target
Name:
Cytochrome P450 2C9
Synonyms:
(R)-limonene 6-monooxygenase CP2C9_HUMAN CYP2C9 Cytochrome P450 2C9 (CYP2C9 ) P-450MP P450 PB-1 | S-mephenytoin 4-hydroxylase
Type:
Enzyme
Mol. Mass.:
55636.33
Organism:
Homo sapiens (Human)
Description:
P11712
Residue:
490
  
Inhibitor
Name:
BDBM50331168
Synonyms:
1-(1-(2-(pyrrolidin-1-yl)ethyl)-1H-indazol-5-yl)-4-(4-(trifluoromethyl)phenyl)pyridin-2(1H)-one | CHEMBL1290041
Type:
Small organic molecule
Emp. Form.:
C25H23F3N4O
Mol. Mass.:
452.4715
SMILES:
FC(F)(F)c1ccc(cc1)-c1ccn(-c2ccc3n(CCN4CCCC4)ncc3c2)c(=O)c1
: